BDBM94717 2-chloranyl-N-[2-[(2E)-2-[(5-nitrothiophen-2-yl)methylidene]hydrazinyl]-2-oxidanylidene-ethyl]benzamide::2-chloro-N-(2-{(2E)-2-[(5-nitrothien-2-yl)methylene]hydrazino}-2-oxoethyl)benzamide::2-chloro-N-[2-[(2E)-2-[(5-nitro-2-thiophenyl)methylidene]hydrazinyl]-2-oxoethyl]benzamide::2-chloro-N-[2-[(2E)-2-[(5-nitrothiophen-2-yl)methylidene]hydrazinyl]-2-oxoethyl]benzamide::2-chloro-N-[2-keto-2-[(N'E)-N'-[(5-nitro-2-thienyl)methylene]hydrazino]ethyl]benzamide::MLS000584349::SMR000203512::cid_9641148
SMILES [O-][N+](=O)c1ccc(\C=N\NC(=O)CNC(=O)c2ccccc2Cl)s1
InChI Key InChIKey=JRFSFYPJPILXHZ-REZTVBANSA-N
Data  1 EC50
  Tab Delimited (TSV)   2D SDfile   Computed 3D by Vconf -m prep SDfile
Find this compound or compounds like it in BindingDB:
Activity Spreadsheet -- Enzyme Inhibition Constant Data from BindingDB
Found 1 hit for monomerid = 94717
TargetXylosyl- and glucuronyltransferase LARGE1(Homo sapiens (Human))
Burnham Center For Chemical Genomics
Curated by PubChem BioAssay
LigandPNGBDBM94717(2-chloranyl-N-[2-[(2E)-2-[(5-nitrothiophen-2-yl)me...)
Affinity DataEC50:  7.48E+3nM
In DepthDetails PCBioAssay